Reaction Details
TargetEnoyl-[acyl-carrier-protein] reductase [NADH]
LigandBDBM16299
Substrate/CompetitorBDBM16293
Meas. Tech.Measurement of Inhibition Constants
pH6.8±n/a
Temperature295.15±n/a K
Ki 30.3±4.7 nM
Km29000±n/a nM
Citation Sullivan, TJTruglio, JJBoyne, MENovichenok, PZhang, XStratton, CFLi, HJKaur, TAmin, AJohnson, FSlayden, RAKisker, CTonge, PJ High affinity InhA inhibitors with activity against drug-resistant strains of Mycobacterium tuberculosis. ACS Chem Biol1:43-53 (2006) 
 
Enoyl-[acyl-carrier-protein] reductase [NADH]
Name:Enoyl-[acyl-carrier-protein] reductase [NADH]
Type:Enzyme
Mol. Mass.:28526.00
Organism:Mycobacterium tuberculosis (strain ATCC 25618 / H37Rv)
Description:P9WGR1
Residue:269
BDBM16299
BDBM16293
NameBDBM16299
Synonyms:14PP | 2-phenoxy-5-tetradecylphenol
TypeSmall organic molecule
Emp. Form.C26H38O2
Mol. Mass.382.5787
c1ccc(Oc2ccccc2)c(O)c1