Reaction Details
TargetMitogen-activated protein kinase 9
LigandBDBM50332082
Substrate/Competitorn/a
Meas. Tech.HTRF Assay
IC50>10000±n/a nM
Citation Sham, HLHom, RKKonradi, AWProbst, GDBowers, STruong, ANeitz, RJSealy, JToth, G Inhibitors of Jun N-terminal kinase US Patent US9796706 Publication Date 10/24/2017
 
Mitogen-activated protein kinase 9
Name:Mitogen-activated protein kinase 9
Type:Enzyme
Mol. Mass.:48131.49
Organism:Homo sapiens (Human)
Description:JNK-2 was purchased from Upstate Cell Signaling Solutions (formerly Upstate Biotechnology).
Residue:424
BDBM50332082
NameBDBM50332082
Synonyms:2-(4-methoxyphenyl)-N-(2-(oxazol-2-yl)thiophen-3-yl)acetamide US9796706, Compound 57
TypeSmall organic molecule
Emp. Form.C16H14N2O3S
Mol. Mass.314.359
SMILESCOc1ccc(CC(=O)Nc2ccsc2-c2ncco2)cc1