Reaction Details
TargetNuclear receptor ROR-gamma
LigandBDBM351564
Substrate/Competitorn/a
Meas. Tech.Binding Assay
Ki<100±n/a nM
Citation Claremon, DADillard, LWDong, CFan, YJia, LLotesta, SDMarcus, ASingh, SBTice, CMYuan, JZhao, WZheng, YZhuang, L Dihydropyrrolopyridine inhibitors of ROR-gamma US Patent US9796710 Publication Date 10/24/2017
 
Nuclear receptor ROR-gamma
Name:Nuclear receptor ROR-gamma
Type:Enzyme Catalytic Domain
Mol. Mass.:58218.40
Organism:Homo sapiens (Human)
Description:P51449
Residue:518
BDBM351564
NameBDBM351564
Synonyms:US9796710, Compound 3
TypeSmall organic molecule
Emp. Form.C26H33F3N4O5S
Mol. Mass.570.624
SMILESCC[C@@H]1N(C[C@H]2CC[C@H](OC2)C(F)(F)F)Cc2cc(cnc12)C(=O)N[C@@H](CO)c1ccc(cn1)S(=O)(=O)CC