Reaction Details
TargetNuclear receptor ROR-gamma
LigandBDBM351594
Substrate/Competitorn/a
Meas. Tech.Binding Assay
Ki<100±n/a nM
Citation Claremon, DADillard, LWDong, CFan, YJia, LLotesta, SDMarcus, ASingh, SBTice, CMYuan, JZhao, WZheng, YZhuang, L Dihydropyrrolopyridine inhibitors of ROR-gamma US Patent US9796710 Publication Date 10/24/2017
 
Nuclear receptor ROR-gamma
Name:Nuclear receptor ROR-gamma
Type:Enzyme Catalytic Domain
Mol. Mass.:58218.40
Organism:Homo sapiens (Human)
Description:P51449
Residue:518
BDBM351594
NameBDBM351594
Synonyms:US9796710, Compound 4 | US9796710, Compound 5
TypeSmall organic molecule
Emp. Form.C27H35F3N4O5S
Mol. Mass.584.651
SMILESCCS(=O)(=O)c1ccc(nc1)[C@H](CO)NC(=O)c1cnc2[C@H](C(C)C)N(C[C@H]3CC[C@@H](OC3)C(F)(F)F)Cc2c1