Reaction Details
TargetNuclear receptor ROR-gamma
LigandBDBM351624
Substrate/Competitorn/a
Meas. Tech.Binding Assay
Ki<100±n/a nM
Citation Claremon, DADillard, LWDong, CFan, YJia, LLotesta, SDMarcus, ASingh, SBTice, CMYuan, JZhao, WZheng, YZhuang, L Dihydropyrrolopyridine inhibitors of ROR-gamma US Patent US9796710 Publication Date 10/24/2017
 
Nuclear receptor ROR-gamma
Name:Nuclear receptor ROR-gamma
Type:Enzyme Catalytic Domain
Mol. Mass.:58218.40
Organism:Homo sapiens (Human)
Description:P51449
Residue:518
BDBM351624
NameBDBM351624
Synonyms:US9796710, Compound 10
TypeSmall organic molecule
Emp. Form.C27H34F3N3O5S
Mol. Mass.569.636
SMILESCC[C@@H]1N(C[C@H]2CC[C@@H](OC2)C(F)(F)F)Cc2cc(cnc12)C(=O)N[C@@H](CO)c1ccc(cc1)S(=O)(=O)CC