Reaction Details
TargetProteinase-activated receptor 4
LigandBDBM176195
Substrate/Competitorn/a
Meas. Tech. PAR4 FLIPR assay
Temperature298.15±n/a K
EC50 0.180±n/a nM
Commentsextracted
Citation Banville, JRemillard, RRuediger, EHDeon, DHGagnon, MDube, LGuy, JPriestley, ESPosy, SLMaxwell, BDWong, PCLawrence, RMMiller, MM Imidazothiadiazole and imidazopyrazine derivatives as protease activated receptor 4 (PAR4) inhibitors for treating platelet aggregation US Patent US10047103 Publication Date 8/14/2018
 
Proteinase-activated receptor 4
Name:Proteinase-activated receptor 4
Type:Protein
Mol. Mass.:41145.16
Organism:Homo sapiens (Human)
Description:Q96RI0
Residue:385
BDBM176195
NameBDBM176195
Synonyms:US10047103, 228 | US9688695, 228
TypeSmall organic molecule
Emp. Form.C25H18FN5O3S
Mol. Mass.487.506
SMILESCOc1cc(OCc2csc(n2)-c2ccc(F)nc2)c2cc(oc2c1)-c1cn2nc(C)ccc2n1