Reaction Details
TargetProteinase-activated receptor 4
LigandBDBM176259
Substrate/Competitorn/a
Meas. Tech. PAR4 FLIPR assay
Temperature298.15±n/a K
EC50 0.270±n/a nM
Commentsextracted
Citation Banville, JRemillard, RRuediger, EHDeon, DHGagnon, MDube, LGuy, JPriestley, ESPosy, SLMaxwell, BDWong, PCLawrence, RMMiller, MM Imidazothiadiazole and imidazopyrazine derivatives as protease activated receptor 4 (PAR4) inhibitors for treating platelet aggregation US Patent US10047103 Publication Date 8/14/2018
 
Proteinase-activated receptor 4
Name:Proteinase-activated receptor 4
Type:Protein
Mol. Mass.:41145.16
Organism:Homo sapiens (Human)
Description:Q96RI0
Residue:385
BDBM176259
NameBDBM176259
Synonyms:US10047103, 292 | US9688695, 292
TypeSmall organic molecule
Emp. Form.C30H26N6O5S2
Mol. Mass.614.695
SMILESCCN(CCC#N)C(=O)c1ccc(cc1)-c1nc(COc2cc(OC)cc3oc(cc23)-c2cn3nc(OC)sc3n2)cs1