Reaction Details
TargetCarbonic anhydrase 2
LigandBDBM16653
Substrate/CompetitorBDBM11326
Meas. Tech.Esterase Assay
Ki 17±n/a nM
Citation Vullo, DFranchi, MGallori, EAntel, JScozzafava, ASupuran, CT Carbonic anhydrase inhibitors. Inhibition of mitochondrial isozyme V with aromatic and heterocyclic sulfonamides. J Med Chem47:1272-9 (2004) 
 
Carbonic anhydrase 2
Name:Carbonic anhydrase 2
Type:Enzyme
Mol. Mass.:29250.71
Organism:Homo sapiens (Human)
Description:P00918
Residue:260
BDBM16653
BDBM11326
NameBDBM16653
Synonyms:2,3,4,5,6-pentafluoro-N-(4-sulfamoylphenyl)benzamide aromatic sulfonamide compound 18
TypeSmall organic molecule
Emp. Form.C13H7F5N2O3S
Mol. Mass.366.263
SMILESNS(=O)(=O)c1ccc(NC(=O)c2c(F)c(F)c(F)c(F)c2F)cc1