Reaction Details
TargetCarbonic anhydrase 2
LigandBDBM16672
Substrate/CompetitorBDBM11326
Meas. Tech.Esterase Assay
Ki 17±n/a nM
Citation Vullo, DFranchi, MGallori, EAntel, JScozzafava, ASupuran, CT Carbonic anhydrase inhibitors. Inhibition of mitochondrial isozyme V with aromatic and heterocyclic sulfonamides. J Med Chem47:1272-9 (2004) 
 
Carbonic anhydrase 2
Name:Carbonic anhydrase 2
Type:Enzyme
Mol. Mass.:29250.71
Organism:Homo sapiens (Human)
Description:P00918
Residue:260
BDBM16672
BDBM11326
NameBDBM16672
Synonyms:5-Benzoylimino-4-methyl-delta2-1,3,4-thiadiazoline-2-sulfonamide heterocyclic sulfonamide compound 37
TypeSmall organic molecule
Emp. Form.C10H10N4O3S2
Mol. Mass.298.341
SMILESCn1nc(s\c1=N\C(=O)c1ccccc1)S(N)(=O)=O