Reaction Details
TargetCarbonic anhydrase 4
LigandBDBM10861
Substrate/CompetitorBDBM11326
Meas. Tech.Esterase Assay
Ki 2500±n/a nM
Citation Vullo, DFranchi, MGallori, EAntel, JScozzafava, ASupuran, CT Carbonic anhydrase inhibitors. Inhibition of mitochondrial isozyme V with aromatic and heterocyclic sulfonamides. J Med Chem47:1272-9 (2004) 
 
Carbonic anhydrase 4
Name:Carbonic anhydrase 4
Type:Enzyme
Mol. Mass.:35152.74
Organism:Bos taurus (bovine)
Description:Bovine isozyme, isolated from lung microsomes
Residue:312
BDBM10861
BDBM11326
NameBDBM10861
Synonyms:4-(2-aminoethyl)benzene-1-sulfonamide aromatic sulfonamide compound 7 | aromatic/heteroaromatic sulfonamide 6
TypeSmall organic molecule
Emp. Form.C8H12N2O2S
Mol. Mass.200.258
SMILESNCCc1ccc(cc1)S(N)(=O)=O