Reaction Details
TargetCarbonic anhydrase 4
LigandBDBM16661
Substrate/CompetitorBDBM11326
Meas. Tech.Esterase Assay
Ki 15±n/a nM
Citation Vullo, DFranchi, MGallori, EAntel, JScozzafava, ASupuran, CT Carbonic anhydrase inhibitors. Inhibition of mitochondrial isozyme V with aromatic and heterocyclic sulfonamides. J Med Chem47:1272-9 (2004) 
 
Carbonic anhydrase 4
Name:Carbonic anhydrase 4
Type:Enzyme
Mol. Mass.:35152.74
Organism:Bos taurus (bovine)
Description:Bovine isozyme, isolated from lung microsomes
Residue:312
BDBM16661
BDBM11326
NameBDBM16661
Synonyms:1-N-(4-fluorobenzene)benzene-1,4-disulfonamide | aromatic sulfonamide compound 26
TypeSmall organic molecule
Emp. Form.C12H11FN2O4S2
Mol. Mass.330.355
SMILESNS(=O)(=O)c1ccc(NS(=O)(=O)c2ccc(F)cc2)cc1