Reaction Details
TargetCarbonic anhydrase 4
LigandBDBM11615
Substrate/CompetitorBDBM11326
Meas. Tech.Esterase Assay
Ki 8±n/a nM
Citation Vullo, DFranchi, MGallori, EAntel, JScozzafava, ASupuran, CT Carbonic anhydrase inhibitors. Inhibition of mitochondrial isozyme V with aromatic and heterocyclic sulfonamides. J Med Chem47:1272-9 (2004) 
 
Carbonic anhydrase 4
Name:Carbonic anhydrase 4
Type:Enzyme
Mol. Mass.:35152.74
Organism:Bos taurus (bovine)
Description:Bovine isozyme, isolated from lung microsomes
Residue:312
BDBM11615
BDBM11326
NameBDBM11615
Synonyms:N-{4-[(5-sulfamoyl-1,3,4-thiadiazol-2-yl)sulfamoyl]phenyl}acetamide aminobenzolamide deriv. 39
TypeSmall organic molecule
Emp. Form.C10H11N5O5S3
Mol. Mass.377.42
SMILESCC(=O)Nc1ccc(cc1)S(=O)(=O)Nc1nnc(s1)S(N)(=O)=O