Reaction Details
TargetCarbonic anhydrase 4
LigandBDBM11617
Substrate/CompetitorBDBM11326
Meas. Tech.Esterase Assay
Ki 4±n/a nM
Citation Vullo, DFranchi, MGallori, EAntel, JScozzafava, ASupuran, CT Carbonic anhydrase inhibitors. Inhibition of mitochondrial isozyme V with aromatic and heterocyclic sulfonamides. J Med Chem47:1272-9 (2004) 
 
Carbonic anhydrase 4
Name:Carbonic anhydrase 4
Type:Enzyme
Mol. Mass.:35152.74
Organism:Bos taurus (bovine)
Description:Bovine isozyme, isolated from lung microsomes
Residue:312
BDBM11617
BDBM11326
NameBDBM11617
Synonyms:5-(4-Acetamido-3-chlorobenzenesulfonamido)-1,3,4-thiadiazole-2-sulfonamide aminobenzolamide 16c | aminobenzolamide deriv. 41
TypeSmall organic molecule
Emp. Form.C10H10ClN5O5S3
Mol. Mass.411.865
SMILESCC(=O)Nc1ccc(cc1Cl)S(=O)(=O)Nc1nnc(s1)S(N)(=O)=O