Reaction Details
TargetCarbonic anhydrase 5A, mitochondrial
LigandBDBM16643
Substrate/CompetitorBDBM10856
Meas. Tech.Esterase Assay
Ki 212±n/a nM
Citation Vullo, DFranchi, MGallori, EAntel, JScozzafava, ASupuran, CT Carbonic anhydrase inhibitors. Inhibition of mitochondrial isozyme V with aromatic and heterocyclic sulfonamides. J Med Chem47:1272-9 (2004) 
 
Carbonic anhydrase 5A, mitochondrial
Name:Carbonic anhydrase 5A, mitochondrial
Type:Enzyme
Mol. Mass.:34081.17
Organism:Mus musculus (mouse)
Description:Full length murine, cloned isozyme.
Residue:299
BDBM16643
BDBM10856
NameBDBM16643
Synonyms:4-Acetamido-benzenesulfonamide N-(4-sulfamoylphenyl)acetamide | aromatic sulfonamide compound 8
TypeSmall organic molecule
Emp. Form.C8H10N2O3S
Mol. Mass.214.242
SMILESCC(=O)Nc1ccc(cc1)S(N)(=O)=O