Reaction Details
TargetCarbonic anhydrase 5A, mitochondrial
LigandBDBM16647
Substrate/CompetitorBDBM10856
Meas. Tech.Esterase Assay
Ki 233±n/a nM
Citation Vullo, DFranchi, MGallori, EAntel, JScozzafava, ASupuran, CT Carbonic anhydrase inhibitors. Inhibition of mitochondrial isozyme V with aromatic and heterocyclic sulfonamides. J Med Chem47:1272-9 (2004) 
 
Carbonic anhydrase 5A, mitochondrial
Name:Carbonic anhydrase 5A, mitochondrial
Type:Enzyme
Mol. Mass.:34081.17
Organism:Mus musculus (mouse)
Description:Full length murine, cloned isozyme.
Residue:299
BDBM16647
BDBM10856
NameBDBM16647
Synonyms:2-methyl-N-(4-sulfamoylphenyl)propanamide CHEMBL23417 | aromatic sulfonamide compound 12
TypeSmall organic molecule
Emp. Form.C10H14N2O3S
Mol. Mass.242.295
SMILESCC(C)C(=O)Nc1ccc(cc1)S(N)(=O)=O