Reaction Details
TargetCarbonic anhydrase 5A, mitochondrial
LigandBDBM16661
Substrate/CompetitorBDBM10856
Meas. Tech.Esterase Assay
Ki 20±n/a nM
Citation Vullo, DFranchi, MGallori, EAntel, JScozzafava, ASupuran, CT Carbonic anhydrase inhibitors. Inhibition of mitochondrial isozyme V with aromatic and heterocyclic sulfonamides. J Med Chem47:1272-9 (2004) 
 
Carbonic anhydrase 5A, mitochondrial
Name:Carbonic anhydrase 5A, mitochondrial
Type:Enzyme
Mol. Mass.:34081.17
Organism:Mus musculus (mouse)
Description:Full length murine, cloned isozyme.
Residue:299
BDBM16661
BDBM10856
NameBDBM16661
Synonyms:1-N-(4-fluorobenzene)benzene-1,4-disulfonamide | aromatic sulfonamide compound 26
TypeSmall organic molecule
Emp. Form.C12H11FN2O4S2
Mol. Mass.330.355
SMILESNS(=O)(=O)c1ccc(NS(=O)(=O)c2ccc(F)cc2)cc1