Reaction Details
TargetCarbonic anhydrase 5A, mitochondrial
LigandBDBM16669
Substrate/CompetitorBDBM10856
Meas. Tech.Esterase Assay
Ki 76±n/a nM
Citation Vullo, DFranchi, MGallori, EAntel, JScozzafava, ASupuran, CT Carbonic anhydrase inhibitors. Inhibition of mitochondrial isozyme V with aromatic and heterocyclic sulfonamides. J Med Chem47:1272-9 (2004) 
 
Carbonic anhydrase 5A, mitochondrial
Name:Carbonic anhydrase 5A, mitochondrial
Type:Enzyme
Mol. Mass.:34081.17
Organism:Mus musculus (mouse)
Description:Full length murine, cloned isozyme.
Residue:299
BDBM16669
BDBM10856
NameBDBM16669
Synonyms:CHEMBL281376 heterocyclic sulfonamide compound 34
TypeSmall organic molecule
Emp. Form.C9H8N4O3S2
Mol. Mass.284.315
SMILESNS(=O)(=O)c1nnc(NC(=O)c2ccccc2)s1