Reaction Details
TargetCarbonic anhydrase 5A, mitochondrial
LigandBDBM16670
Substrate/CompetitorBDBM10856
Meas. Tech.Esterase Assay
Ki 13±n/a nM
Citation Vullo, DFranchi, MGallori, EAntel, JScozzafava, ASupuran, CT Carbonic anhydrase inhibitors. Inhibition of mitochondrial isozyme V with aromatic and heterocyclic sulfonamides. J Med Chem47:1272-9 (2004) 
 
Carbonic anhydrase 5A, mitochondrial
Name:Carbonic anhydrase 5A, mitochondrial
Type:Enzyme
Mol. Mass.:34081.17
Organism:Mus musculus (mouse)
Description:Full length murine, cloned isozyme.
Residue:299
BDBM16670
BDBM10856
NameBDBM16670
Synonyms:2,3,4,5,6-pentafluoro-N-(5-sulfamoyl-1,3,4-thiadiazol-2-yl)benzamide heterocyclic sulfonamide compound 35
TypeSmall organic molecule
Emp. Form.C9H3F5N4O3S2
Mol. Mass.374.267
SMILESNS(=O)(=O)c1nnc(NC(=O)c2c(F)c(F)c(F)c(F)c2F)s1