Reaction Details
TargetCarbonic anhydrase 5A, mitochondrial
LigandBDBM16671
Substrate/CompetitorBDBM10856
Meas. Tech.Esterase Assay
Ki 87±n/a nM
Citation Vullo, DFranchi, MGallori, EAntel, JScozzafava, ASupuran, CT Carbonic anhydrase inhibitors. Inhibition of mitochondrial isozyme V with aromatic and heterocyclic sulfonamides. J Med Chem47:1272-9 (2004) 
 
Carbonic anhydrase 5A, mitochondrial
Name:Carbonic anhydrase 5A, mitochondrial
Type:Enzyme
Mol. Mass.:34081.17
Organism:Mus musculus (mouse)
Description:Full length murine, cloned isozyme.
Residue:299
BDBM16671
BDBM10856
NameBDBM16671
Synonyms:N-[(2E)-3-methyl-5-sulfamoyl-2,3-dihydro-1,3,4-thiadiazol-2-ylidene]furan-2-carboxamide | heterocyclic sulfonamide compound 36
TypeSmall organic molecule
Emp. Form.C8H8N4O4S2
Mol. Mass.288.304
SMILESCn1nc(s\c1=N\C(=O)c1ccco1)S(N)(=O)=O