Reaction Details
TargetCarbonic anhydrase 5A, mitochondrial
LigandBDBM11618
Substrate/CompetitorBDBM10856
Meas. Tech.Esterase Assay
Ki 4±n/a nM
Citation Vullo, DFranchi, MGallori, EAntel, JScozzafava, ASupuran, CT Carbonic anhydrase inhibitors. Inhibition of mitochondrial isozyme V with aromatic and heterocyclic sulfonamides. J Med Chem47:1272-9 (2004) 
 
Carbonic anhydrase 5A, mitochondrial
Name:Carbonic anhydrase 5A, mitochondrial
Type:Enzyme
Mol. Mass.:34081.17
Organism:Mus musculus (mouse)
Description:Full length murine, cloned isozyme.
Residue:299
BDBM11618
BDBM10856
NameBDBM11618
Synonyms:5-(4-Acetamido-3-bromobenzenesulfonamido)-1,3,4-thiadiazole-2-sulfonamide aminobenzolamide 16d | aminobenzolamide deriv. 42
TypeSmall organic molecule
Emp. Form.C10H10BrN5O5S3
Mol. Mass.456.316
SMILESCC(=O)Nc1ccc(cc1Br)S(=O)(=O)Nc1nnc(s1)S(N)(=O)=O