Reaction Details
TargetTyrosine-protein kinase BTK
LigandBDBM164773
Substrate/Competitorn/a
Meas. Tech.Enzyme Assay
IC50 0.090±n/a nM
Citation Liu, QWatterson, SHAhmad, STebben, AJ Indole carboxamide compounds US Patent US9802915 Publication Date 10/31/2017
 
Tyrosine-protein kinase BTK
Name:Tyrosine-protein kinase BTK
Type:Enzyme
Mol. Mass.:76289.95
Organism:Homo sapiens (Human)
Description:Q06187
Residue:659
BDBM164773
NameBDBM164773
Synonyms:US10604504, Example 174 US9688629, 173 US9802915, Example 174 | US9920031, Example 174
TypeSmall organic molecule
Emp. Form.C22H25FN4O2
Mol. Mass.396.4579
SMILESCC#CC(=O)N1CCCC2CN(CC12)c1c(F)cc(C(N)=O)c2[nH]c(C)c(C)c12