Reaction Details
TargetCathepsin S
LigandBDBM352420
Substrate/Competitorn/a
Meas. Tech.Enzyme Assay
Ki 160±n/a nM
Citation Nardi, ARatcliffe, PCraan, THertrampf, TLesch, BSteinhagen, H 3-oxo-tetrahydro-furo[3,2-b]pyrrol-4(5H)-yl) derivatives II US Patent US9802947 Publication Date 10/31/2017
 
Cathepsin S
Name:Cathepsin S
Type:Protein
Mol. Mass.:37507.38
Organism:Homo sapiens (Human)
Description:P25774
Residue:331
BDBM352420
NameBDBM352420
Synonyms:N—((S)-2-((3aS,6S,6aS)-6-chloro-3-oxotetrahydro-2H-furo[3,2-b]pyrrol-4(5H)-yl)-1-cyclopentyl-2-oxoethyl)-5-(pyridin-4-yl)thiophene-2-carboxamide | US9802947, Compound Example 8
TypeSmall organic molecule
Emp. Form.C23H24ClN3O4S
Mol. Mass.473.972
SMILESCl[C@H]1CN([C@H]2[C@@H]1OCC2=O)C(=O)[C@@H](NC(=O)c1ccc(s1)-c1ccncc1)C1CCCC1