Reaction Details
TargetPhosphatidylinositol 3-kinase catalytic subunit type 3
LigandBDBM338030
Substrate/Competitorn/a
Meas. Tech.Enzyme Assay
IC50<10±n/a nM
Citation Bharathan, ITBlackburn, CCiavarri, JPChouitar, JCullis, CAD Amore, NFleming, PEGigstad, KMGipson, KEGirard, MHu, YLee, JLi, GRezaei, MSintchak, MDSoucy, FStroud, SGVos, TJWong, TXu, HXu, TYe, Y Heteroaryls and uses thereof US Patent US9802960 Publication Date 10/31/2017
 
Phosphatidylinositol 3-kinase catalytic subunit type 3
Name:Phosphatidylinositol 3-kinase catalytic subunit type 3
Type:Enzyme
Mol. Mass.:101551.30
Organism:Homo sapiens (Human)
Description:Recombinant human Vps34 protein was expressed as monomeric GST-fusion and purified.
Residue:887
BDBM338030
NameBDBM338030
Synonyms:US9751854, Compound I-206 | US9802960, Compound I-206
TypeSmall organic molecule
Emp. Form.C19H16ClFN4O3S
Mol. Mass.434.872
SMILESCC(=O)Nc1cc(ccn1)-c1cnc(C)c(NS(=O)(=O)c2ccc(F)cc2Cl)c1