Reaction Details
TargetPhosphodiesterase
LigandBDBM355382
Substrate/Competitorn/a
Meas. Tech.Fluorescence Polarization (FP) Assay
Ki 1.10±n/a nM
Citation Shen, DMEgbertson, MBerger, RQian, XQian, YHarper, BYang, MGuo, ZZRada, VLWang, DCernak, TASinz, CWang, MWilson, JEXu, S Pyrimidone carboxamide compounds as PDE2 inhibitors US Patent US9815796 Publication Date 11/14/2017
 
Phosphodiesterase
Name:Phosphodiesterase
Type:Enzyme Catalytic Domain
Mol. Mass.:105547.91
Organism:Macaca mulatta (Rhesus macaque)
Description:n/a
Residue:941
BDBM355382
NameBDBM355382
Synonyms:N-{(1R)-1-[3-fluoro-4- (trifluoromethoxy)phenyl]-2- methylpropyl}-2-(4- methoxybenzyl)-6-oxo-1,6- dihydropyrimidine-4-carboxamide | US9815796, Example 473
TypeSmall organic molecule
Emp. Form.C24H23F4N3O4
Mol. Mass.493.4507
SMILESCOc1ccc(Cc2nc(cc(=O)[nH]2)C(=O)N[C@H](C(C)C)c2ccc(OC(F)(F)F)c(F)c2)cc1