Reaction Details
TargetPhosphodiesterase
LigandBDBM355415
Substrate/Competitorn/a
Meas. Tech.Fluorescence Polarization (FP) Assay
Ki 0.920±n/a nM
Citation Shen, DMEgbertson, MBerger, RQian, XQian, YHarper, BYang, MGuo, ZZRada, VLWang, DCernak, TASinz, CWang, MWilson, JEXu, S Pyrimidone carboxamide compounds as PDE2 inhibitors US Patent US9815796 Publication Date 11/14/2017
 
Phosphodiesterase
Name:Phosphodiesterase
Type:Enzyme Catalytic Domain
Mol. Mass.:105547.91
Organism:Macaca mulatta (Rhesus macaque)
Description:n/a
Residue:941
BDBM355415
NameBDBM355415
Synonyms:2-(3-fluoro-4-methoxybenzyl)-N- {(1R)-1-[3-fluoro-4- (trifluoromethoxy)phenyl]-2,2- dimethylpropyl}-6-oxo-1,6- dihydropyrimidine-4-carboxamide | US9815796, Example 506
TypeSmall organic molecule
Emp. Form.C25H24F5N3O4
Mol. Mass.525.4678
SMILESCOc1ccc(Cc2nc(cc(=O)[nH]2)C(=O)N[C@@H](c2ccc(OC(F)(F)F)c(F)c2)C(C)(C)C)cc1F