Reaction Details
TargetCoagulation factor X
LigandBDBM17284
Substrate/CompetitorBDBM12658
Meas. Tech.Enzyme Inhibition Assay
pH7.5±n/a
Temperature295.15±n/a K
Ki 0.11±n/a nM
Citation Adler, MDavey, DDPhillips, GBKim, SHJancarik, JRumennik, GLight, DRWhitlow, M Preparation, characterization, and the crystal structure of the inhibitor ZK-807834 (CI-1031) complexed with factor Xa. Biochemistry39:12534-42 (2000) 
 
Coagulation factor X
Name:Coagulation factor X
Type:Enzyme
Mol. Mass.:54726.60
Organism:Homo sapiens (Human)
Description:n/a
Residue:488
BDBM17284
BDBM12658
NameBDBM17284
Synonyms:2-{[2-(5-carbamimidoyl-2-hydroxyphenoxy)-3,5-difluoro-6-[3-(1-methyl-4,5-dihydro-1H-imidazol-2-yl)phenoxy]pyridin-4-yl](methyl)amino}acetic acid CI-1031 | ZK-807834
TypeSmall organic molecule
Emp. Form.C25H24F2N6O5
Mol. Mass.526.4921
SMILESCN(CC(O)=O)c1c(F)c(Oc2cccc(c2)C2=NCCN2C)nc(Oc2cc(ccc2O)C(N)=N)c1F