Reaction Details
TargetMethionine aminopeptidase 2
LigandBDBM17358
Substrate/CompetitorBDBM17353
Meas. Tech.Enzyme Inhibition Assay
pH7.5±n/a
Temperature295.15±n/a K
Ki 0.23±n/a nM
Km300000±n/a nM
Citation Marino, JPFisher, PWHofmann, GAKirkpatrick, RBJanson, CAJohnson, RKMa, CMattern, MMeek, TDRyan, MDSchulz, CSmith, WWTew, DGTomazek, TAVeber, DFXiong, WCYamamoto, YYamashita, KYang, GThompson, SK Highly potent inhibitors of methionine aminopeptidase-2 based on a 1,2,4-triazole pharmacophore. J Med Chem50:3777-85 (2007) 
 
Methionine aminopeptidase 2
Name:Methionine aminopeptidase 2
Type:Enzyme
Mol. Mass.:52884.45
Organism:Homo sapiens (Human)
Description:P50579
Residue:478
BDBM17358
BDBM17353
NameBDBM17358
Synonyms:1,2,4-Triazole Compound, 16 | 5-{[(2-fluorophenyl)methyl]sulfanyl}-N-(2-methylphenyl)-4H-1,2,4-triazol-3-amine
TypeSmall organic molecule
Emp. Form.C16H15FN4S
Mol. Mass.314.381
SMILESCc1ccccc1Nc1nnc(SCc2ccccc2F)[nH]1