Reaction Details
TargetMethionine aminopeptidase 2
LigandBDBM17363
Substrate/CompetitorBDBM17353
Meas. Tech.Enzyme Inhibition Assay
pH7.5±n/a
Temperature295.15±n/a K
Ki 3.8±n/a nM
Km300000±n/a nM
Citation Marino, JPFisher, PWHofmann, GAKirkpatrick, RBJanson, CAJohnson, RKMa, CMattern, MMeek, TDRyan, MDSchulz, CSmith, WWTew, DGTomazek, TAVeber, DFXiong, WCYamamoto, YYamashita, KYang, GThompson, SK Highly potent inhibitors of methionine aminopeptidase-2 based on a 1,2,4-triazole pharmacophore. J Med Chem50:3777-85 (2007) 
 
Methionine aminopeptidase 2
Name:Methionine aminopeptidase 2
Type:Enzyme
Mol. Mass.:52884.45
Organism:Homo sapiens (Human)
Description:P50579
Residue:478
BDBM17363
BDBM17353
NameBDBM17363
Synonyms:1,2,4-Triazole Compound, 21 | 5-{[(2-methyl-1,3-thiazol-4-yl)methyl]sulfanyl}-N-(2-methylphenyl)-4H-1,2,4-triazol-3-amine
TypeSmall organic molecule
Emp. Form.C14H15N5S2
Mol. Mass.317.432
SMILESCc1nc(CSc2nnc(Nc3ccccc3C)[nH]2)cs1