Reaction Details
TargetMethionine aminopeptidase 2
LigandBDBM17383
Substrate/CompetitorBDBM17353
Meas. Tech.Enzyme Inhibition Assay
Ki 2.5±n/a nM
Citation Marino, JPFisher, PWHofmann, GAKirkpatrick, RBJanson, CAJohnson, RKMa, CMattern, MMeek, TDRyan, MDSchulz, CSmith, WWTew, DGTomazek, TAVeber, DFXiong, WCYamamoto, YYamashita, KYang, GThompson, SK Highly potent inhibitors of methionine aminopeptidase-2 based on a 1,2,4-triazole pharmacophore. J Med Chem50:3777-85 (2007) 
 
Methionine aminopeptidase 2
Name:Methionine aminopeptidase 2
Type:Enzyme
Mol. Mass.:52884.45
Organism:Homo sapiens (Human)
Description:P50579
Residue:478
BDBM17383
BDBM17353
NameBDBM17383
Synonyms:1,2,4-Triazole Compound, 41 | N-(4-chlorophenyl)-5-[(pyridin-4-ylmethyl)sulfanyl]-4H-1,2,4-triazol-3-amine
TypeSmall organic molecule
Emp. Form.C14H12ClN5S
Mol. Mass.317.797
SMILESClc1ccc(Nc2nnc(SCc3ccncc3)[nH]2)cc1