Reaction Details
TargetMethionine aminopeptidase 2
LigandBDBM17405
Substrate/CompetitorBDBM17353
Meas. Tech.Enzyme Inhibition Assay
Ki 0.9±n/a nM
Citation Marino, JPFisher, PWHofmann, GAKirkpatrick, RBJanson, CAJohnson, RKMa, CMattern, MMeek, TDRyan, MDSchulz, CSmith, WWTew, DGTomazek, TAVeber, DFXiong, WCYamamoto, YYamashita, KYang, GThompson, SK Highly potent inhibitors of methionine aminopeptidase-2 based on a 1,2,4-triazole pharmacophore. J Med Chem50:3777-85 (2007) 
 
Methionine aminopeptidase 2
Name:Methionine aminopeptidase 2
Type:Enzyme
Mol. Mass.:52884.45
Organism:Homo sapiens (Human)
Description:P50579
Residue:478
BDBM17405
BDBM17353
NameBDBM17405
Synonyms:1,2,4-Triazole Compound, 63 | N-(3,4-dimethoxyphenyl)-5-[(3-methylbut-2-en-1-yl)sulfanyl]-4H-1,2,4-triazol-3-amine
TypeSmall organic molecule
Emp. Form.C15H20N4O2S
Mol. Mass.320.41
SMILESCOc1ccc(Nc2nnc(SCC=C(C)C)[nH]2)cc1OC