Reaction Details
TargetMethionine aminopeptidase 2
LigandBDBM17433
Substrate/CompetitorBDBM17353
Meas. Tech.Enzyme Inhibition Assay
Ki 3.0±n/a nM
Citation Marino, JPFisher, PWHofmann, GAKirkpatrick, RBJanson, CAJohnson, RKMa, CMattern, MMeek, TDRyan, MDSchulz, CSmith, WWTew, DGTomazek, TAVeber, DFXiong, WCYamamoto, YYamashita, KYang, GThompson, SK Highly potent inhibitors of methionine aminopeptidase-2 based on a 1,2,4-triazole pharmacophore. J Med Chem50:3777-85 (2007) 
 
Methionine aminopeptidase 2
Name:Methionine aminopeptidase 2
Type:Enzyme
Mol. Mass.:52884.45
Organism:Homo sapiens (Human)
Description:P50579
Residue:478
BDBM17433
BDBM17353
NameBDBM17433
Synonyms:1,2,4-Triazole Compound, 91 | N-{5-[(pyridin-4-ylmethyl)sulfanyl]-4H-1,2,4-triazol-3-yl}pyridin-3-amine
TypeSmall organic molecule
Emp. Form.C13H12N6S
Mol. Mass.284.34
SMILESC(Sc1nnc(Nc2cccnc2)[nH]1)c1ccncc1