Reaction Details
TargetHigh affinity nerve growth factor receptor
LigandBDBM356068
Substrate/Competitorn/a
Meas. Tech.Functional Activity Assay
IC50 0.400±n/a nM
Citation Mitchell, HFraley, MECooke, AJStump, CAChen, YZhang, XMcComas, CCSchirripa, KMcWherter, MMercer, SPBabaoglu, KMeng, DWu, JLiu, PWood, HBBao, JLi, CSMao, QQi, Z TrkA kinase inhibitors, compositions and methods thereof US Patent US9815846 Publication Date 11/14/2017
 
High affinity nerve growth factor receptor
Name:High affinity nerve growth factor receptor
Type:n/a
Mol. Mass.:87498.18
Organism:Homo sapiens (Human)
Description:P04629
Residue:796
BDBM356068
NameBDBM356068
Synonyms:2-fluoro-5-(1-methyl-1H- pyrazol-3-yl)-N-(2-((2- (methylsulfonyl)acetamido)methyl)- 4-phenylpyrimidin-5-yl)-4- (trifluoromethyl)benzamide | US9815846, Compound 68
TypeSmall organic molecule
Emp. Form.C27H21F4N9O2
Mol. Mass.579.5084
SMILESCn1ccc(n1)-c1cc(C(=O)Nc2cnc(CNC(=O)Cn3cncn3)nc2-c2ccccc2)c(F)cc1C(F)(F)F