Reaction Details
TargetHigh affinity nerve growth factor receptor
LigandBDBM356226
Substrate/Competitorn/a
Meas. Tech.Functional Activity Assay
IC50 0.350±n/a nM
Citation Mitchell, HFraley, MECooke, AJStump, CAChen, YZhang, XMcComas, CCSchirripa, KMcWherter, MMercer, SPBabaoglu, KMeng, DWu, JLiu, PWood, HBBao, JLi, CSMao, QQi, Z TrkA kinase inhibitors, compositions and methods thereof US Patent US9815846 Publication Date 11/14/2017
 
High affinity nerve growth factor receptor
Name:High affinity nerve growth factor receptor
Type:n/a
Mol. Mass.:87498.18
Organism:Homo sapiens (Human)
Description:P04629
Residue:796
BDBM356226
NameBDBM356226
Synonyms:N-(2-((2,4-dioxo-3,4- dihydropyrimidin-1(2H)- yl)methyl)-4-phenylpyrimidin-5- yl)-2-fluoro-5-(1-methyl-1H- pyrazol-3-yl)-4- (trifluoromethyl)benzamide | US9815846, Compound 226
TypeSmall organic molecule
Emp. Form.C27H19F4N7O3
Mol. Mass.565.4785
SMILESCn1ccc(n1)-c1cc(C(=O)Nc2cnc(Cn3ccc(=O)[nH]c3=O)nc2-c2ccccc2)c(F)cc1C(F)(F)F