Reaction Details
TargetHigh affinity nerve growth factor receptor
LigandBDBM356227
Substrate/Competitorn/a
Meas. Tech.Functional Activity Assay
IC50 0.240±n/a nM
Citation Mitchell, HFraley, MECooke, AJStump, CAChen, YZhang, XMcComas, CCSchirripa, KMcWherter, MMercer, SPBabaoglu, KMeng, DWu, JLiu, PWood, HBBao, JLi, CSMao, QQi, Z TrkA kinase inhibitors, compositions and methods thereof US Patent US9815846 Publication Date 11/14/2017
 
High affinity nerve growth factor receptor
Name:High affinity nerve growth factor receptor
Type:n/a
Mol. Mass.:87498.18
Organism:Homo sapiens (Human)
Description:P04629
Residue:796
BDBM356227
NameBDBM356227
Synonyms:2-fluoro-5-(1-methyl-1H- pyrazol-3-yl)-N-(2-((5-oxo-1,5- dihydro-4H-1,2,4-triazol-4- yl)methyl)-4-phenylpyrimidin-5- yl)-4- (trifluoromethyl)benzamide | US9815846, Compound 227
TypeSmall organic molecule
Emp. Form.C25H18F4N8O2
Mol. Mass.538.4564
SMILESCn1ccc(n1)-c1cc(C(=O)Nc2cnc(Cn3cn[nH]c3=O)nc2-c2ccccc2)c(F)cc1C(F)(F)F