Reaction Details
TargetHistone deacetylase 4
LigandBDBM228164
Substrate/Competitorn/a
Meas. Tech.HDAC4 Biochemical
IC50 3.00±n/a nM
Citation Maillard, MCBreccia, PDominguez, CHaughan, AFJarvis, RELuckhurst, CASaville-Stones, EAStott, AJVan de Poël, AWall, MWishart, G Histone deacetylase inhibitors and compositions and methods of use thereof US Patent US10047073 Publication Date 8/14/2018
 
Histone deacetylase 4
Name:Histone deacetylase 4
Type:Enzyme
Mol. Mass.:119049.39
Organism:Homo sapiens (Human)
Description:P56524
Residue:1084
BDBM228164
NameBDBM228164
Synonyms:US10047073, 6 | US10047073, 7
TypeSmall organic molecule
Emp. Form.C21H23F3N4O2
Mol. Mass.420.4281
SMILESFC(F)(F)c1nc(no1)-c1ccc(cc1)C(=O)NC1(CN2CCCC2C2CC2)CC1