Reaction Details
TargetMethionine aminopeptidase 2
LigandBDBM17462
Substrate/CompetitorBDBM17353
Meas. Tech.Enzyme Inhibition Assay
pH7.5±n/a
Temperature295.15±n/a K
Ki 18±n/a nM
Citation Kallander, LSLu, QChen, WTomaszek, TYang, GTew, DMeek, TDHofmann, GASchulz-Pritchard, CKSmith, WWJanson, CARyan, MDZhang, GFJohanson, KOKirkpatrick, RBHo, TFFisher, PWMattern, MRJohnson, RKHansbury, MJWinkler, JDWard, KWVeber, DFThompson, SK 4-Aryl-1,2,3-triazole: a novel template for a reversible methionine aminopeptidase 2 inhibitor, optimized to inhibit angiogenesis in vivo. J Med Chem48:5644-7 (2005) 
 
Methionine aminopeptidase 2
Name:Methionine aminopeptidase 2
Type:Enzyme
Mol. Mass.:52884.45
Organism:Homo sapiens (Human)
Description:P50579
Residue:478
BDBM17462
BDBM17353
NameBDBM17462
Synonyms:1,2,3-triazole analogue, 18 CHEMBL194853
TypeSmall organic molecule
Emp. Form.C9H9N3
Mol. Mass.159.1879
SMILESCc1cccc(c1)-c1c[nH]nn1