Reaction Details
TargetMethionine aminopeptidase 2
LigandBDBM17476
Substrate/CompetitorBDBM17353
Meas. Tech.Enzyme Inhibition Assay
pH7.5±n/a
Temperature295.15±n/a K
Ki 52±n/a nM
Citation Kallander, LSLu, QChen, WTomaszek, TYang, GTew, DMeek, TDHofmann, GASchulz-Pritchard, CKSmith, WWJanson, CARyan, MDZhang, GFJohanson, KOKirkpatrick, RBHo, TFFisher, PWMattern, MRJohnson, RKHansbury, MJWinkler, JDWard, KWVeber, DFThompson, SK 4-Aryl-1,2,3-triazole: a novel template for a reversible methionine aminopeptidase 2 inhibitor, optimized to inhibit angiogenesis in vivo. J Med Chem48:5644-7 (2005) 
 
Methionine aminopeptidase 2
Name:Methionine aminopeptidase 2
Type:Enzyme
Mol. Mass.:52884.45
Organism:Homo sapiens (Human)
Description:P50579
Residue:478
BDBM17476
BDBM17353
NameBDBM17476
Synonyms:1,2,3-triazole analogue, 32 | 2-methyl-6-(1H-1,2,3-triazol-5-yl)pyridine
TypeSmall organic molecule
Emp. Form.C8H8N4
Mol. Mass.160.1759
SMILESCc1cccc(n1)-c1c[nH]nn1