Reaction Details
TargetAldo-keto reductase family 1 member C3
LigandBDBM17636
Substrate/CompetitorBDBM17637
Meas. Tech.3alpha-Androstanediol Oxidation Inhibition Assay
pH7±n/a
Temperature303.15±n/a K
Ki 140±10 nM
Km32000±2000 nM
CommentsCompetitive inhibition.
Citation Lovering, ALRide, JPBunce, CMDesmond, JCCummings, SMWhite, SA Crystal structures of prostaglandin D(2) 11-ketoreductase (AKR1C3) in complex with the nonsteroidal anti-inflammatory drugs flufenamic acid and indomethacin. Cancer Res64:1802-10 (2004) 
 
Aldo-keto reductase family 1 member C3
Name:Aldo-keto reductase family 1 member C3
Type:Enzyme
Mol. Mass.:36859.86
Organism:Homo sapiens (Human)
Description:P42330
Residue:323
BDBM17636
BDBM17637
NameBDBM17636
Synonyms:2-{[3-(trifluoromethyl)phenyl]amino}benzoic acid CHEMBL23588 Nichisedan US9271961, Flufenamic Acid
TypeSmall organic molecule
Emp. Form.C14H10F3NO2
Mol. Mass.281.2299
SMILESOC(=O)c1ccccc1Nc1cccc(c1)C(F)(F)F