Reaction Details
TargetAmine oxidase [flavin-containing] A
LigandBDBM254546
Substrate/Competitorn/a
Meas. Tech.Biological Assays-Inhibition of LSD1
IC50>100000±n/a nM
Citation Ortega Muñoz, AFyfe, MCMartinell Pedemonte, MEstiarte Martinez, MValls Vidal, NKurz, GCastro Palomino Laria, JC (Hetero)aryl cyclopropylamine compounds as LSD1 inhibitors US Patent US10214477 Publication Date 2/26/2019
 
Amine oxidase [flavin-containing] A
Name:Amine oxidase [flavin-containing] A
Type:Protein
Mol. Mass.:59689.53
Organism:Homo sapiens (Human)
Description:P21397
Residue:527
BDBM254546
NameBDBM254546
Synonyms:US10214477, Example 3 US9670136, 5 (trans)-N1-((1R,2S)-2-phenylcyclopropyl)cyclohexane-1,4-diamine
TypeSmall organic molecule
Emp. Form.C15H22N2
Mol. Mass.230.3486
SMILESNC1CCC(CC1)N[C@H]1C[C@@H]1c1ccccc1