Reaction Details
TargetAmine oxidase [flavin-containing] A
LigandBDBM254581
Substrate/Competitorn/a
Meas. Tech.Biological Assays-Inhibition of LSD1
IC50>100000±n/a nM
Citation Ortega Muñoz, AFyfe, MCMartinell Pedemonte, MEstiarte Martinez, MValls Vidal, NKurz, GCastro Palomino Laria, JC (Hetero)aryl cyclopropylamine compounds as LSD1 inhibitors US Patent US10214477 Publication Date 2/26/2019
 
Amine oxidase [flavin-containing] A
Name:Amine oxidase [flavin-containing] A
Type:Protein
Mol. Mass.:59689.53
Organism:Homo sapiens (Human)
Description:P21397
Residue:527
BDBM254581
NameBDBM254581
Synonyms:US10214477, Example 40 US9670136, 40 N1-((trans)-2-(4-cyclopropylphenyl)cyclopropyl)cyclohexane-1,4-diamine
TypeSmall organic molecule
Emp. Form.C18H26N2
Mol. Mass.270.4124
SMILESNC1CCC(CC1)N[C@H]1C[C@@H]1c1ccc(cc1)C1CC1