Reaction Details
TargetSodium channel protein type 9 subunit alpha
LigandBDBM357002
Substrate/Competitorn/a
Meas. Tech.Nav1.7 and Nav1.5 Screening Assay
IC50 400±n/a nM
Citation Duffy, JChambers, MSRae, AOsborne, JLemasson, IAGoldsmith, MDSharpe, AFonquerna Pou, S Amino-substituted heterocyclic derivatives as sodium channel inhibitors US Patent US10214509 Publication Date 2/26/2019
 
Sodium channel protein type 9 subunit alpha
Name:Sodium channel protein type 9 subunit alpha
Type:Protein
Mol. Mass.:226375.97
Organism:Homo sapiens (Human)
Description:Q15858
Residue:1988
BDBM357002
NameBDBM357002
Synonyms:5-Amino-3-ethyl-1-(2-methoxyphenyl)-N-(5-(trifluoromethyl)pyridin-2-yl)-1H-pyrazole-4-carboxamide | US10214509, Example 114
TypeSmall organic molecule
Emp. Form.C19H18F3N5O2
Mol. Mass.405.3737
SMILESCCc1nn(c(N)c1C(=O)Nc1ccc(cn1)C(F)(F)F)-c1ccccc1OC