Reaction Details
TargetSodium channel protein type 9 subunit alpha
LigandBDBM357003
Substrate/Competitorn/a
Meas. Tech.Nav1.7 and Nav1.5 Screening Assay
IC50 700±n/a nM
Citation Duffy, JChambers, MSRae, AOsborne, JLemasson, IAGoldsmith, MDSharpe, AFonquerna Pou, S Amino-substituted heterocyclic derivatives as sodium channel inhibitors US Patent US10214509 Publication Date 2/26/2019
 
Sodium channel protein type 9 subunit alpha
Name:Sodium channel protein type 9 subunit alpha
Type:Protein
Mol. Mass.:226375.97
Organism:Homo sapiens (Human)
Description:Q15858
Residue:1988
BDBM357003
NameBDBM357003
Synonyms:5-Amino-1-(2-(2-methoxyethoxy)phenyl)-3-methyl-N-(2-methyl-4-(trifluoromethyl)phenyl)-1H-pyrazole-4-carboxamide | US10214509, Example 115
TypeSmall organic molecule
Emp. Form.C22H23F3N4O3
Mol. Mass.448.4382
SMILESCOCCOc1ccccc1-n1nc(C)c(C(=O)Nc2ccc(cc2C)C(F)(F)F)c1N