Reaction Details
TargetSodium channel protein type 5 subunit alpha
LigandBDBM357006
Substrate/Competitorn/a
Meas. Tech.Nav1.7 and Nav1.5 Screening Assay
IC50 10000±n/a nM
Citation Duffy, JChambers, MSRae, AOsborne, JLemasson, IAGoldsmith, MDSharpe, AFonquerna Pou, S Amino-substituted heterocyclic derivatives as sodium channel inhibitors US Patent US10214509 Publication Date 2/26/2019
 
Sodium channel protein type 5 subunit alpha
Name:Sodium channel protein type 5 subunit alpha
Type:Enzyme
Mol. Mass.:226908.60
Organism:Homo sapiens (Human)
Description:Q14524
Residue:2016
BDBM357006
NameBDBM357006
Synonyms:5-Amino-3-ethyl-1-(3-fluoro-2-methylphenyl)-N-[5-trifluoromethyl-2-pyridyl]pyrazole-4-carboxamide | US10214509, Example 143
TypeSmall organic molecule
Emp. Form.C19H17F4N5O
Mol. Mass.407.3648
SMILESCCc1nn(c(N)c1C(=O)Nc1ccc(cn1)C(F)(F)F)-c1cccc(F)c1C