Reaction Details
TargetCoagulation factor XI
LigandBDBM357025
Substrate/Competitorn/a
Meas. Tech.Factor XIa Assay
Ki 0.130±n/a nM
Citation Xu, JAli, AZhou, WGao, YEdmondson, SDMertz, ENeelamkavil, SFLiu, WSun, WShen, DHarper, BZhu, CBara, TLim, YYang, M Factor XIA inhibitors US Patent US10214512 Publication Date 2/26/2019
 
Coagulation factor XI
Name:Coagulation factor XI
Type:Enzyme
Mol. Mass.:70130.58
Organism:Homo sapiens (Human)
Description:P03951
Residue:625
BDBM357025
NameBDBM357025
Synonyms:2-(25-carboxy-4-oxo-3-aza-1(1,3),2(1,2)-dibenzenacyclononaphane-9-yl)-5-(3-chloro-2-fluoro-6-(1H-tetrazol-1-yl)phenyl)pyridine 1-oxide | US10214512, Example 5-a
TypeSmall organic molecule
Emp. Form.C31H24ClFN6O4
Mol. Mass.599.011
SMILESOC(=O)c1ccc2NC(=O)CCCC[C@@H](c3cccc(c3)-c2c1)c1ccc(c[n+]1[O-])-c1c(F)c(Cl)ccc1-n1cnnn1