Reaction Details
TargetCoagulation factor XI
LigandBDBM357206
Substrate/Competitorn/a
Meas. Tech.Factor XIa Assay
Ki 0.130±n/a nM
Citation Xu, JAli, AZhou, WGao, YEdmondson, SDMertz, ENeelamkavil, SFLiu, WSun, WShen, DHarper, BZhu, CBara, TLim, YYang, M Factor XIA inhibitors US Patent US10214512 Publication Date 2/26/2019
 
Coagulation factor XI
Name:Coagulation factor XI
Type:Enzyme
Mol. Mass.:70130.58
Organism:Homo sapiens (Human)
Description:P03951
Residue:625
BDBM357206
NameBDBM357206
Synonyms:US10214512, Example 150-a
TypeSmall organic molecule
Emp. Form.C31H29F4N5O5
Mol. Mass.627.5861
SMILESCOC(=O)Nc1ccc2-c3nc([nH]c3C)[C@H](CCC[C@@H](C)C(=O)Nc2c1)c1ccc(c[n+]1[O-])-c1c(OC(F)F)ccc(F)c1F