Reaction Details
TargetCoagulation factor XI
LigandBDBM357230
Substrate/Competitorn/a
Meas. Tech.Factor XIa Assay
Ki 0.210±n/a nM
Citation Xu, JAli, AZhou, WGao, YEdmondson, SDMertz, ENeelamkavil, SFLiu, WSun, WShen, DHarper, BZhu, CBara, TLim, YYang, M Factor XIA inhibitors US Patent US10214512 Publication Date 2/26/2019
 
Coagulation factor XI
Name:Coagulation factor XI
Type:Enzyme
Mol. Mass.:70130.58
Organism:Homo sapiens (Human)
Description:P03951
Residue:625
BDBM357230
NameBDBM357230
Synonyms:5-(5-chloro-2-(4-(trifluoromethyl)-1H-1,2,3-triazol-1-yl)phenyl)-2-(11-(difluoromethyl)-8-oxo-11H-9-aza-1(5,4)-pyrazola-2(1,3) -benzenacyclononaphane-3-Yl)pyridine 1-oxide | US10214512, Example 165
TypeSmall organic molecule
Emp. Form.C30H23ClF5N7O2
Mol. Mass.643.994
SMILES[O-][n+]1cc(ccc1C1CCCCC(=O)Nc2cnn(C(F)F)c2-c2cccc1c2)-c1cc(Cl)ccc1-n1cc(nn1)C(F)(F)F