Reaction Details
TargetKallikrein-1
LigandBDBM357033
Substrate/Competitorn/a
Meas. Tech.Kallikrein Assay
Ki 1.55±n/a nM
Citation Xu, JAli, AZhou, WGao, YEdmondson, SDMertz, ENeelamkavil, SFLiu, WSun, WShen, DHarper, BZhu, CBara, TLim, YYang, M Factor XIA inhibitors US Patent US10214512 Publication Date 2/26/2019
 
Kallikrein-1
Name:Kallikrein-1
Type:Enzyme
Mol. Mass.:28874.69
Organism:Homo sapiens (Human)
Description:P06870
Residue:262
BDBM357033
NameBDBM357033
Synonyms:5-(3-Chloro-2,6-difluorophenyl)-2-(24-((methoxycarbonyl)amino)-4-oxo -3-aza-1(1,3),2(1,2)-dibenzenacyclononaphane-9-yl)pyridine 1-oxide | US10214512, Example 13-a
TypeSmall organic molecule
Emp. Form.C31H26ClF2N3O4
Mol. Mass.578.006
SMILESCOC(=O)Nc1ccc-2c(NC(=O)CCCCC(c3cccc-2c3)c2ccc(c[n+]2[O-])-c2c(F)ccc(Cl)c2F)c1