Reaction Details
TargetKallikrein-1
LigandBDBM357055
Substrate/Competitorn/a
Meas. Tech.Kallikrein Assay
Ki 0.700±n/a nM
Citation Xu, JAli, AZhou, WGao, YEdmondson, SDMertz, ENeelamkavil, SFLiu, WSun, WShen, DHarper, BZhu, CBara, TLim, YYang, M Factor XIA inhibitors US Patent US10214512 Publication Date 2/26/2019
 
Kallikrein-1
Name:Kallikrein-1
Type:Enzyme
Mol. Mass.:28874.69
Organism:Homo sapiens (Human)
Description:P06870
Residue:262
BDBM357055
NameBDBM357055
Synonyms:US10214512, Example 35
TypeSmall organic molecule
Emp. Form.C34H29ClN4O5
Mol. Mass.609.071
SMILESCOC(=O)Nc1ccc-2c(NC(=O)CCCC[C@@H](c3cccc-2c3)c2ccc(c[n+]2[O-])-c2cc(Cl)ccc2-c2cnco2)c1