Reaction Details
TargetKallikrein-1
LigandBDBM357105
Substrate/Competitorn/a
Meas. Tech.Kallikrein Assay
Ki 2919±n/a nM
Citation Xu, JAli, AZhou, WGao, YEdmondson, SDMertz, ENeelamkavil, SFLiu, WSun, WShen, DHarper, BZhu, CBara, TLim, YYang, M Factor XIA inhibitors US Patent US10214512 Publication Date 2/26/2019
 
Kallikrein-1
Name:Kallikrein-1
Type:Enzyme
Mol. Mass.:28874.69
Organism:Homo sapiens (Human)
Description:P06870
Residue:262
BDBM357105
NameBDBM357105
Synonyms:US10214512, Example 79-a US10214512, Example 79-c | US10214512, Example 79-d
TypeSmall organic molecule
Emp. Form.C35H33ClFN7O2
Mol. Mass.638.134
SMILES[O-][n+]1cc(ccc1C1CCCCC(Nc2ccc(F)cc2-c2cccc1c2)C(=O)N1CCCC1)-c1cc(Cl)ccc1-n1cnnn1