Reaction Details
TargetKallikrein-1
LigandBDBM357118
Substrate/Competitorn/a
Meas. Tech.Kallikrein Assay
Ki 1.29±n/a nM
Citation Xu, JAli, AZhou, WGao, YEdmondson, SDMertz, ENeelamkavil, SFLiu, WSun, WShen, DHarper, BZhu, CBara, TLim, YYang, M Factor XIA inhibitors US Patent US10214512 Publication Date 2/26/2019
 
Kallikrein-1
Name:Kallikrein-1
Type:Enzyme
Mol. Mass.:28874.69
Organism:Homo sapiens (Human)
Description:P06870
Residue:262
BDBM357118
NameBDBM357118
Synonyms:5-(3-Chloro-2,6-difluorophenyl)-2-(16-fluoro-24-((methoxycarbonyl)amino)-5-methyl-4-oxo-3-aza-1(1,3),2(1,2) -dibenzenacyclononaphane-9-yl)pyridine 1-oxide | US10214512, Example 86-a
TypeSmall organic molecule
Emp. Form.C32H27ClF3N3O4
Mol. Mass.610.023
SMILESCOC(=O)Nc1ccc-2c(NC(=O)[C@H](C)CCC[C@@H](c3ccc(F)c-2c3)c2ccc(c[n+]2[O-])-c2c(F)ccc(Cl)c2F)c1